In file included from builds/unix/ftsystem.c:21:
./builds/unix/ftconfig.h:199:2: error: #error "no 32bit type found -- please check your configuration files"
In file included from /usr/local/directadmin/custombuild/freetype-2.3.8/include/freetype/freetype.h:43,
from /usr/local/directadmin/custombuild/freetype-2.3.8/include/freetype/internal/ftdebug.h:30,
from builds/unix/ftsystem.c:22:
/usr/local/directadmin/custombuild/freetype-2.3.8/include/freetype/fttypes.h:172: error: expected â=â, â,â, â;â, âasmâ or â__attribute__â before âFT_Tagâ
In file included from /usr/local/directadmin/custombuild/freetype-2.3.8/include/freetype/internal/ftdebug.h:30,
from builds/unix/ftsystem.c:22:
/usr/local/directadmin/custombuild/freetype-2.3.8/include/freetype/freetype.h:658: error: âFT_UInt32â undeclared here (not in a function)
/usr/local/directadmin/custombuild/freetype-2.3.8/include/freetype/freetype.h:2293: error: expected declaration specifiers or â...â before âFT_Int32â
/usr/local/directadmin/custombuild/freetype-2.3.8/include/freetype/freetype.h:2328: error: expected declaration specifiers or â...â before âFT_Int32â
/usr/local/directadmin/custombuild/freetype-2.3.8/include/freetype/freetype.h:3434: error: expected â=â, â,â, â;â, âasmâ or â__attribute__â before â*â token
/usr/local/directadmin/custombuild/freetype-2.3.8/include/freetype/freetype.h:3467: error: expected â=â, â,â, â;â, âasmâ or â__attribute__â before â*â token
/usr/local/directadmin/custombuild/freetype-2.3.8/include/freetype/freetype.h:3501: error: expected â=â, â,â, â;â, âasmâ or â__attribute__â before â*â token
In file included from /usr/local/directadmin/custombuild/freetype-2.3.8/include/freetype/internal/ftobjs.h:35,
from /usr/local/directadmin/custombuild/freetype-2.3.8/include/freetype/internal/ftstream.h:25,
from builds/unix/ftsystem.c:26:
/usr/local/directadmin/custombuild/freetype-2.3.8/include/freetype/internal/ftdriver.h:83: error: expected declaration specifiers or â...â before âFT_Int32â
/usr/local/directadmin/custombuild/freetype-2.3.8/include/freetype/internal/ftdriver.h:111: error: expected declaration specifiers or â...â before âFT_Int32â
In file included from /usr/local/directadmin/custombuild/freetype-2.3.8/include/freetype/internal/ftobjs.h:36,
from /usr/local/directadmin/custombuild/freetype-2.3.8/include/freetype/internal/ftstream.h:25,
from builds/unix/ftsystem.c:26:
/usr/local/directadmin/custombuild/freetype-2.3.8/include/freetype/internal/autohint.h:179: error: expected declaration specifiers or â...â before âFT_Int32â
In file included from /usr/local/directadmin/custombuild/freetype-2.3.8/include/freetype/internal/ftstream.h:25,
from builds/unix/ftsystem.c:26:
/usr/local/directadmin/custombuild/freetype-2.3.8/include/freetype/internal/ftobjs.h:89: error: expected â=â, â,â, â;â, âasmâ or â__attribute__â before âft_highpow2â
/usr/local/directadmin/custombuild/freetype-2.3.8/include/freetype/internal/ftobjs.h:157: error: expected declaration specifiers or â...â before âFT_UInt32â
/usr/local/directadmin/custombuild/freetype-2.3.8/include/freetype/internal/ftobjs.h:161: error: expected declaration specifiers or â...â before âFT_UInt32â
/usr/local/directadmin/custombuild/freetype-2.3.8/include/freetype/internal/ftobjs.h:166: error: expected declaration specifiers or â...â before âFT_UInt32â
/usr/local/directadmin/custombuild/freetype-2.3.8/include/freetype/internal/ftobjs.h:167: error: expected declaration specifiers or â...â before âFT_UInt32â
/usr/local/directadmin/custombuild/freetype-2.3.8/include/freetype/internal/ftobjs.h:171: error: expected declaration specifiers or â...â before âFT_UInt32â
/usr/local/directadmin/custombuild/freetype-2.3.8/include/freetype/internal/ftobjs.h:172: error: expected declaration specifiers or â...â before âFT_UInt32â
/usr/local/directadmin/custombuild/freetype-2.3.8/include/freetype/internal/ftobjs.h:174: error: expected â=â, â,â, â;â, âasmâ or â__attribute__â before â*â token
/usr/local/directadmin/custombuild/freetype-2.3.8/include/freetype/internal/ftobjs.h:178: error: expected â=â, â,â, â;â, âasmâ or â__attribute__â before â*â token
/usr/local/directadmin/custombuild/freetype-2.3.8/include/freetype/internal/ftobjs.h:183: error: expected â=â, â,â, â;â, âasmâ or â__attribute__â before â*â token
/usr/local/directadmin/custombuild/freetype-2.3.8/include/freetype/internal/ftobjs.h:202: error: expected specifier-qualifier-list before âFT_CMap_VariantListFuncâ
make: *** [/usr/local/directadmin/custombuild/freetype-2.3.8/objs/ftsystem.lo] Error 1
*** The make has failed, do you want to try to make again? (y,n):